Skip to content

feat(files): add the Project file backend and APIs #35913

feat(files): add the Project file backend and APIs

feat(files): add the Project file backend and APIs #35913

Triggered via pull request October 13, 2026 07:54
Status Failure
Total duration 11m 6s
Artifacts 10

ci.yml

on: pull_request
version
version
desktop-changes
0s
desktop-changes
trigger-upload
0s
trigger-upload
Matrix: image-amd64
Matrix: image-arm64
Matrix: image-dev
docs-changes
0s
docs-changes
migrate-dev  /  migrate
migrate-dev / migrate
Matrix: checks / e2e
Matrix: checks / integration
Matrix: checks / test
desktop-signing
0s
desktop-signing
Matrix: checks / e2e-mobile
prerelease-create
prerelease-create
prerelease-build  /  build
prerelease-build / build
migrate  /  migrate
migrate / migrate
prerelease-publish
prerelease-publish
promote
promote
prerelease-prune
prerelease-prune
Matrix: ghcr
docs  /  embeddings
docs / embeddings
trigger-promote
trigger-promote
attest-subjects
attest-subjects
Matrix: attest
release
release
desktop-release  /  build
desktop-release / build
Fit to window
Zoom out
Zoom in

Annotations

11 errors, 33 warnings, and 1 notice
checks / test (1/2)
Process completed with exit code 1.
scripts/check-project-rollout.test.ts > Project column rollout release acknowledgement > rejects a newer deployment discovered i…: scripts/check-project-rollout.test.ts#L107
AssertionError: expected 2 to be 1 // Object.is equality - Expected + Received - 1 + 2 ❯ scripts/check-project-rollout.test.ts:107:46
scripts/check-project-rollout.test.ts > Project column rollout release acknowledgement > rejects a newer pending release even wh…: scripts/check-project-rollout.test.ts#L107
AssertionError: expected 2 to be 1 // Object.is equality - Expected + Received - 1 + 2 ❯ scripts/check-project-rollout.test.ts:107:46
scripts/check-project-rollout.test.ts > Project column rollout release acknowledgement > rejects a stale acknowledgement after a…: scripts/check-project-rollout.test.ts#L107
AssertionError: expected 2 to be 1 // Object.is equality - Expected + Received - 1 + 2 ❯ scripts/check-project-rollout.test.ts:107:46
scripts/check-project-rollout.test.ts > Project column rollout release acknowledgement > accepts the latest completed acknowledg…: scripts/check-project-rollout.test.ts#L100
AssertionError: python3: can't open file '/home/runner/_work/sim/sim/.github/scripts/check-project-rollout.py': [Errno 2] No such file or directory : expected 2 to be +0 // Object.is equality - Expected + Received - 0 + 2 ❯ scripts/check-project-rollout.test.ts:100:46
checks / lint
Process completed with exit code 1.
check:test-patterns
audit failed — see the group above
checks / lint
Process completed with exit code 1.
checks / test-types
Process completed with exit code 1.
checks / ci
Process completed with exit code 1.
checks / ci
Checks did not pass:
checks / test (1/2)
[git-mirror] Skipping cache commit: Found 2 failed/cancelled steps
checks / test (1/2)
[git-mirror] - Step: unknown (failed)
checks / test (1/2)
Skipping sticky disk commit due to previous step failures
checks / test (1/2)
- Step: unknown (failed)
checks / test (1/2)
Found 2 failed/cancelled steps in previous workflow steps
checks / test (1/2)
Skipping sticky disk commit due to previous step failures
checks / test (1/2)
- Step: unknown (failed)
checks / test (1/2)
Found 2 failed/cancelled steps in previous workflow steps
checks / test (1/2)
Skipping sticky disk commit due to previous step failures
checks / test (1/2)
- Step: unknown (failed)
checks / test (1/2)
Found 2 failed/cancelled steps in previous workflow steps
checks / lint
[git-mirror] Skipping cache commit: Found 2 failed/cancelled steps
checks / lint
[git-mirror] - Step: unknown (failed)
checks / lint
Skipping sticky disk commit due to previous step failures
checks / lint
- Step: unknown (failed)
checks / lint
Found 2 failed/cancelled steps in previous workflow steps
checks / lint
Skipping sticky disk commit due to previous step failures
checks / lint
- Step: unknown (failed)
checks / lint
Found 2 failed/cancelled steps in previous workflow steps
checks / lint
Skipping sticky disk commit due to previous step failures
checks / lint
- Step: unknown (failed)
checks / lint
Found 2 failed/cancelled steps in previous workflow steps
checks / test-types
[git-mirror] Skipping cache commit: Found 2 failed/cancelled steps
checks / test-types
[git-mirror] - Step: unknown (failed)
checks / test-types
Skipping sticky disk commit due to previous step failures
checks / test-types
- Step: unknown (failed)
checks / test-types
Found 2 failed/cancelled steps in previous workflow steps
checks / test-types
Skipping sticky disk commit due to previous step failures
checks / test-types
- Step: unknown (failed)
checks / test-types
Found 2 failed/cancelled steps in previous workflow steps
Slow Test: apps/desktop/e2e/desktop-tools-live-sim.spec.ts#L0
apps/desktop/e2e/desktop-tools-live-sim.spec.ts took 6.8m
checks / ci
[git-mirror] Skipping cache commit: Found 2 failed/cancelled steps
checks / ci
[git-mirror] - Step: unknown (failed)
🎭 Playwright Run Summary
12 passed (7.8m)

Artifacts

Produced during runtime
Name Size Digest
integration-reports-migrate-1
27.2 KB
sha256:1779c6deaa501618592d55de48e9931089c13a309dcafe6db44d719408a7cf22
integration-reports-migrate-2
36.6 KB
sha256:a5708b2c35e8f478d2c1997cbe0f74d988e12f305b4513b0181bbd9a458715c2
integration-reports-migrate-3
38.7 KB
sha256:4055f560418c0251344ddd4436da954db4916503f30ca24d848a2295c309ab68
integration-reports-migrate-4
40.6 KB
sha256:8acccee09cd89abcca865fb5215e4a1f5cdebccbe104bc9217b46baf872bde35
integration-reports-push-1
28.6 KB
sha256:8347e28aab7fa283aff61c90e450a600867a771eba2611f0ce26d9a0796ccd2b
integration-reports-push-2
36.5 KB
sha256:dc78c88af33694aa105df9dfabde3fe127e6bc7631c73cbca0e8156cb3138b63
integration-reports-push-3
38.7 KB
sha256:d0aaf77a85e3bbfb350f38544c1f350e2f64ffc4bab14f61a0db04129e86fd97
integration-reports-push-4
40.5 KB
sha256:5a89311d040b4a463ecf4b12a35b6229366a62acdc5d1ee4fc4a8d3231e258c9
next-build
651 MB
sha256:0b7c6374426540e768cb61f6b770718402fb0ee4f834be6bdf423b598d5dbde7
test-types
109 KB
sha256:baa8f2c5f3a94f24715fbc1f1b68bfcb8765c6ae89ed063f7f6753b7464319ab